Errors:

scripts/basic/fixdep.c: In function 'traps':
scripts/basic/fixdep.c:377: warning: dereferencing type-punned pointer will break strict-aliasing rules
scripts/basic/fixdep.c:379: warning: dereferencing type-punned pointer will break strict-aliasing rules
scripts/kconfig/lex.zconf.c:1644: warning: 'input' defined but not used
SYMLINK include/asm -> include/asm-x86
scripts/genksyms/lex.c:1481: warning: 'input' defined but not used
dnsdomainname: Unknown host
UPD include/linux/compile.h
mm/mmap.c: In function 'insert_vm_struct':
mm/mmap.c:2068: warning: 'prev' may be used uninitialized in this function
mm/mmap.c:2069: warning: 'rb_link' may be used uninitialized in this function
mm/mmap.c:2069: warning: 'rb_parent' may be used uninitialized in this function
mm/mmap.c: In function 'copy_vma':
mm/mmap.c:2107: warning: 'prev' may be used uninitialized in this function
mm/mmap.c:2108: warning: 'rb_link' may be used uninitialized in this function
mm/mmap.c:2108: warning: 'rb_parent' may be used uninitialized in this function
mm/mmap.c: In function 'do_brk':
mm/mmap.c:1933: warning: 'prev' may be used uninitialized in this function
mm/mmap.c:1935: warning: 'rb_link' may be used uninitialized in this function
mm/mmap.c:1935: warning: 'rb_parent' may be used uninitialized in this function
mm/mmap.c: In function 'mmap_region':
mm/mmap.c:1078: warning: 'prev' may be used uninitialized in this function
mm/mmap.c:1081: warning: 'rb_link' may be used uninitialized in this function
mm/mmap.c:1081: warning: 'rb_parent' may be used uninitialized in this function
drivers/acpi/tables/tbfadt.c: In function 'acpi_tb_create_local_fadt':
include/asm/string_32.h:65: warning: array subscript is above array bounds
fs/cifs/dir.c: In function 'cifs_ci_compare':
fs/cifs/dir.c:583: warning: passing argument 1 of '__constant_memcpy' discards qualifiers from pointer target type
include/asm/string_32.h:52: note: expected 'void *' but argument is of type 'const unsigned char *'
fs/cifs/dir.c:583: warning: passing argument 1 of '__memcpy' discards qualifiers from pointer target type
include/asm/string_32.h:32: note: expected 'void *' but argument is of type 'const unsigned char *'
fs/dlm/lock.c: In function '_search_rsb':
fs/dlm/lock.c:378: warning: 'r' may be used uninitialized in this function
fs/dlm/lock.c: In function 'find_rsb':
fs/dlm/lock.c:437: warning: 'r' may be used uninitialized in this function
fs/ecryptfs/main.c: In function 'ecryptfs_get_sb':
include/asm/string_32.h:65: warning: array subscript is above array bounds
net/bluetooth/af_bluetooth.c:59: warning: 'bt_key_strings' defined but not used
net/bluetooth/af_bluetooth.c:70: warning: 'bt_slock_key_strings' defined but not used
fs/gfs2/bmap.c: In function 'build_height':
fs/gfs2/bmap.c:251: warning: 'blocks' may be used uninitialized in this function
fs/gfs2/ops_inode.c: In function 'gfs2_mkdir':
include/asm/string_32.h:65: warning: array subscript is above array bounds
{standard input}: Assembler messages:
{standard input}:2409: Error: can't resolve `.LFE1259' {*UND* section} - `.Ltext0' {.text section}
make[2]: *** [drivers/ide/ide-lib.o] Error 1
make[1]: *** [drivers/ide] Error 2
make[1]: *** Waiting for unfinished jobs....
make: *** [drivers] Error 2
make: *** Waiting for unfinished jobs....
fs/nfs/callback_xdr.c: In function 'nfs4_callback_compound':
fs/nfs/callback_xdr.c:404: warning: 'hdr_arg.taglen' may be used uninitialized in this function
fs/nfs/callback_xdr.c:404: warning: 'hdr_arg.nops' may be used uninitialized in this function
fs/nfs/callback_xdr.c:404: warning: 'hdr_arg.tag' may be used uninitialized in this function
net/netfilter/nf_conntrack_proto_sctp.c: In function 'sctp_packet':
net/netfilter/nf_conntrack_proto_sctp.c:374: warning: array subscript is above array bounds
fs/reiserfs/do_balan.c: In function 'balance_leaf':
fs/reiserfs/do_balan.c:1298: warning: operation on 'aux_ih' may be undefined
fs/reiserfs/lbalance.c: In function 'leaf_item_bottle':
fs/reiserfs/lbalance.c:392: warning: operation on 'ih' may be undefined
fs/reiserfs/lbalance.c:420: warning: operation on 'ih' may be undefined
fs/reiserfs/lbalance.c: In function 'leaf_delete_items':
fs/reiserfs/lbalance.c:777: warning: operation on 'ih' may be undefined


Test-Time: 218.16143321991 Seconds

The test exited with a non-zero exit status. Test run failed.


System Information Output:
=====================================
Phoronix Test Suite v2.0.0 (SANDTORG)
System Information
=====================================

Hardware:
Processor: Intel Core 2 Extreme CPU X9650 @ 3.00GHz (Total Cores: 4), Motherboard: EVGA 132-YW-E178-FTW, Chipset: nVidia C55, System Memory: 4 x 1024 MB DRAM-800MHz, Disk: 2 x 500GB WDC WD5000AAKS-0, Graphics: GeForce GTX 260 896MB (626/1053MHz)

Software:
OS: Fedora release 11 (Leonidas), Kernel: 2.6.30.5-43.fc11.i686.PAE (i686), Desktop: KDE 4.3.00, Display Server: X.Org Server 1.6.3, OpenGL: 3.0.0 NVIDIA 185.18.36, Compiler: GCC 4.4.1, File-System: ext3, Screen Resolution: 1680x1050